{"text_format":"1","workbook":"xlsx","n_sheets":5,"sheets":["RACE SETUP","DISPLAY NOTICE","CALCULATIONS","PY DATA","Changes"],"not_rendered":{"charts":0,"images":0,"macros":1,"external_links":0,"defined_names":4,"comments":0,"pivot_tables":0},"unopened":[],"bounds":{"document_bytes":16777216,"sheet_cells":100000,"rows_first":2000,"rows_last":500,"rows_between":2000,"halvings":0,"cell_chars":16384,"cell_head_chars":4096},"cells_cut":0,"cells_raw":0,"read":"whole","date_system":"1900"}

{"sheet":"RACE SETUP","index":0,"n_rows":24,"n_cols":4,"rows_kept":24,"cut":false,"hidden":false,"merged":[]}
[]
[null,"Pursuit Race Timing Sheet  -  RACE SETUP"]
[]
[null,"Race Start Time for Ref PY","12:00:00"," HH:MM"]
[]
[null,"Race Duration for Ref PY",100," minutes"]
[]
[null,"Slowest Class Competing (Ref PY)","Gull"]
[]
[null,"Reference PY",{"$f":"VLOOKUP(C8,'PY DATA'!F3:G97,2,FALSE)","v":1388}]
[]
[null,"Finish",{"$f":"C4+(C6/60)/24","v":"13:40:00"},"  (= Start time + Race duration)"]
[]
[null,"RACE will be "]
[null,{"$f":" \"Based on:\"&\" \"&C8&\" (PY \"&C10&\")  racing for \"&C6&\" minutes\"","v":"Based on: Gull (PY 1388)  racing for 100 minutes"}]
[]
[null,"INSTRUCTIONS"]
[null,"1 - Update the list of classes and PYs in the sheet \"PY DATA\""]
[null,"2 - Enter Race Start Time for the Reference (slowest) class"]
[null,"3 - Enter the Duration of race for the Reference Class"]
[null,"4 - Click in the Slowest Class cell and then open the drop-down list - Choose the Reference class"]
[null,"5 - Check the DISPLAY NOTICE sheet (edit year if necessary) and then Print"]
[]
[null,"[Changes to the list of classes shown on the DISPLAY NOTICE are made in the PY DATA sheet.] "]

{"sheet":"DISPLAY NOTICE","index":1,"n_rows":53,"n_cols":6,"rows_kept":53,"cut":false,"hidden":false,"merged":[[3,3,3,4],[3,1,4,1],[3,5,4,5],[3,2,4,2]]}
[null,"PURSUIT RACE - START TIME OFFSETS FOR EACH CLASS      2025"]
[null,{"$f":"'RACE SETUP'!B15","v":"Based on: Gull (PY 1388)  racing for 100 minutes"}]
[]
[null,"Scheduled Start Time","START TIME OFFSET","Yardstick range",null,"Classes starting"]
[null,null,null,"from","to"]
[]
[null,{"$f":"CALCULATIONS!B28","v":"12:00:00"},0,{"$f":"CALCULATIONS!F28","v":1382},{"$f":"CALCULATIONS!G28","v":1394},{"$f":"CALCULATIONS!I28","v":"Gull"}]
[null,{"$f":"CALCULATIONS!B29","v":"12:01:00"},{"$f":"C7+1","v":1},{"$f":"CALCULATIONS!F29","v":1368},{"$f":"CALCULATIONS!G29","v":1381},{"$f":"CALCULATIONS!I29","v":" "}]
[null,{"$f":"CALCULATIONS!B30","v":"12:02:00"},{"$f":"C8+1","v":2},{"$f":"CALCULATIONS!F30","v":1354},{"$f":"CALCULATIONS!G30","v":1367},{"$f":"CALCULATIONS!I30","v":"Topper"}]
[null,{"$f":"CALCULATIONS!B31","v":"12:03:00"},3,{"$f":"CALCULATIONS!F31","v":1340},{"$f":"CALCULATIONS!G31","v":1353},{"$f":"CALCULATIONS!I31","v":" "}]
[null,{"$f":"CALCULATIONS!B32","v":"12:04:00"},4,{"$f":"CALCULATIONS!F32","v":1326},{"$f":"CALCULATIONS!G32","v":1339},{"$f":"CALCULATIONS!I32","v":"Pico"}]
[null,{"$f":"CALCULATIONS!B33","v":"12:05:00"},5,{"$f":"CALCULATIONS!F33","v":1312},{"$f":"CALCULATIONS!G33","v":1325},{"$f":"CALCULATIONS!I33","v":" "}]
[null,{"$f":"CALCULATIONS!B34","v":"12:06:00"},6,{"$f":"CALCULATIONS!F34","v":1298},{"$f":"CALCULATIONS!G34","v":1311},{"$f":"CALCULATIONS!I34","v":"Quba S"}]
[null,{"$f":"CALCULATIONS!B35","v":"12:07:00"},7,{"$f":"CALCULATIONS!F35","v":1284},{"$f":"CALCULATIONS!G35","v":1297},{"$f":"CALCULATIONS!I35","v":" "}]
[null,{"$f":"CALCULATIONS!B36","v":"12:08:00"},8,{"$f":"CALCULATIONS!F36","v":1271},{"$f":"CALCULATIONS!G36","v":1283},{"$f":"CALCULATIONS!I36","v":"Feva S"}]
[null,{"$f":"CALCULATIONS!B37","v":"12:09:00"},9,{"$f":"CALCULATIONS!F37","v":1257},{"$f":"CALCULATIONS!G37","v":1270},{"$f":"CALCULATIONS!I37","v":"Topaz Uno"}]
[null,{"$f":"CALCULATIONS!B38","v":"12:10:00"},10,{"$f":"CALCULATIONS!F38","v":1243},{"$f":"CALCULATIONS!G38","v":1256},{"$f":"CALCULATIONS!I38","v":" "}]
[null,{"$f":"CALCULATIONS!B39","v":"12:11:00"},11,{"$f":"CALCULATIONS!F39","v":1229},{"$f":"CALCULATIONS!G39","v":1242},{"$f":"CALCULATIONS!I39","v":" "}]
[null,{"$f":"CALCULATIONS!B40","v":"12:12:00"},12,{"$f":"CALCULATIONS!F40","v":1215},{"$f":"CALCULATIONS!G40","v":1228},{"$f":"CALCULATIONS!I40","v":" "}]
[null,{"$f":"CALCULATIONS!B41","v":"12:13:00"},13,{"$f":"CALCULATIONS!F41","v":1201},{"$f":"CALCULATIONS!G41","v":1214},{"$f":"CALCULATIONS!I41","v":4.7}]
[null,{"$f":"CALCULATIONS!B42","v":"12:14:00"},14,{"$f":"CALCULATIONS!F42","v":1187},{"$f":"CALCULATIONS!G42","v":1200},{"$f":"CALCULATIONS!I42","v":"Wanderer,  Miracle,  Lightning"}]
[null,{"$f":"CALCULATIONS!B43","v":"12:15:00"},15,{"$f":"CALCULATIONS!F43","v":1173},{"$f":"CALCULATIONS!G43","v":1186},{"$f":"CALCULATIONS!I43","v":" "}]
[null,{"$f":"CALCULATIONS!B44","v":"12:16:00"},16,{"$f":"CALCULATIONS!F44","v":1159},{"$f":"CALCULATIONS!G44","v":1172},{"$f":"CALCULATIONS!I44","v":"Enterprise,  Graduate (orig)"}]
[null,{"$f":"CALCULATIONS!B45","v":"12:17:00"},17,{"$f":"CALCULATIONS!F45","v":1146},{"$f":"CALCULATIONS!G45","v":1158},{"$f":"CALCULATIONS!I45","v":"Radial,  Europe"}]
[null,{"$f":"CALCULATIONS!B46","v":"12:18:00"},18,{"$f":"CALCULATIONS!F46","v":1132},{"$f":"CALCULATIONS!G46","v":1145},{"$f":"CALCULATIONS!I46","v":"Vision"}]
[null,{"$f":"CALCULATIONS!B47","v":"12:19:00"},19,{"$f":"CALCULATIONS!F47","v":1118},{"$f":"CALCULATIONS!G47","v":1131},{"$f":"CALCULATIONS!I47","v":"Graduate (new),  Streaker"}]
[null,{"$f":"CALCULATIONS!B48","v":"12:20:00"},20,{"$f":"CALCULATIONS!F48","v":1104},{"$f":"CALCULATIONS!G48","v":1117},{"$f":"CALCULATIONS!I48","v":"Wayfarer,  Vareo"}]
[null,{"$f":"CALCULATIONS!B49","v":"12:21:00"},21,{"$f":"CALCULATIONS!F49","v":1090},{"$f":"CALCULATIONS!G49","v":1103},{"$f":"CALCULATIONS!I49","v":"Laser"}]
[null,{"$f":"CALCULATIONS!B50","v":"12:22:00"},22,{"$f":"CALCULATIONS!F50","v":1076},{"$f":"CALCULATIONS!G50","v":1089},{"$f":"CALCULATIONS!I50","v":" "}]
[null,{"$f":"CALCULATIONS!B51","v":"12:23:00"},23,{"$f":"CALCULATIONS!F51","v":1062},{"$f":"CALCULATIONS!G51","v":1075},{"$f":"CALCULATIONS!I51","v":"Vago XD"}]
[null,{"$f":"CALCULATIONS!B52","v":"12:24:00"},24,{"$f":"CALCULATIONS!F52","v":1048},{"$f":"CALCULATIONS!G52","v":1061},{"$f":"CALCULATIONS!I52","v":"Blaze Fire"}]
[null,{"$f":"CALCULATIONS!B53","v":"12:25:00"},25,{"$f":"CALCULATIONS!F53","v":1035},{"$f":"CALCULATIONS!G53","v":1047},{"$f":"CALCULATIONS!I53","v":" "}]
[null,{"$f":"CALCULATIONS!B54","v":"12:26:00"},26,{"$f":"CALCULATIONS!F54","v":1021},{"$f":"CALCULATIONS!G54","v":1034},{"$f":"CALCULATIONS!I54","v":"Blaze"}]
[null,{"$f":"CALCULATIONS!B55","v":"12:27:00"},27,{"$f":"CALCULATIONS!F55","v":1007},{"$f":"CALCULATIONS!G55","v":1020},{"$f":"CALCULATIONS!I55","v":" "}]
[null,{"$f":"CALCULATIONS!B56","v":"12:28:00"},28,{"$f":"CALCULATIONS!F56","v":993},{"$f":"CALCULATIONS!G56","v":1006},{"$f":"CALCULATIONS!I56","v":" "}]
[null,{"$f":"CALCULATIONS!B57","v":"12:29:00"},29,{"$f":"CALCULATIONS!F57","v":979},{"$f":"CALCULATIONS!G57","v":992},{"$f":"CALCULATIONS!I57","v":" "}]
[null,{"$f":"CALCULATIONS!B58","v":"12:30:00"},30,{"$f":"CALCULATIONS!F58","v":965},{"$f":"CALCULATIONS!G58","v":978},{"$f":"CALCULATIONS!I58","v":"Contender"}]
[null,{"$f":"CALCULATIONS!B59","v":"12:31:00"},31,{"$f":"CALCULATIONS!F59","v":951},{"$f":"CALCULATIONS!G59","v":964},{"$f":"CALCULATIONS!I59","v":4000}]
[null,{"$f":"CALCULATIONS!B60","v":"12:32:00"},32,{"$f":"CALCULATIONS!F60","v":937},{"$f":"CALCULATIONS!G60","v":950},{"$f":"CALCULATIONS!I60","v":"Osprey,  RS 400"}]
[null,{"$f":"CALCULATIONS!B61","v":"12:33:00"},33,{"$f":"CALCULATIONS!F61","v":924},{"$f":"CALCULATIONS!G61","v":936},{"$f":"CALCULATIONS!I61","v":" "}]
{"$rows_left_out":14}
{"sheet":"CALCULATIONS","index":2,"n_rows":89,"n_cols":9,"rows_kept":89,"cut":false,"hidden":false,"merged":[]}
[]
[null,"Start",{"$f":"'RACE SETUP'!C4","v":"12:00:00"}]
[null,"Finish",{"$f":"'RACE SETUP'!C12","v":"13:40:00"},null,6.9444444444444436E-4]
[null,"Race",{"$f":"'RACE SETUP'!C6","v":100}," mins",null,null,1480]
[null,"RefPY",{"$f":"'RACE SETUP'!C10","v":1388}]
[]
[null,"Start time","Race length","upper time","upper PY","min PY","max PY","GROUP"]
[]
[null,{"$f":"B10-1/24/60","v":"11:41:00"},{"$f":"C10+1","v":119},{"$f":"C9+0.5","v":119.5},{"$f":"D9/Race*RefPY","v":1658.66},{"$f":"G10+1","v":1645},{"$f":"INT(E9)","v":1658}]
[null,"11:42:00",118,118.5,1644.78,1631,{"$f":"INT(E10)","v":1644}]
[null,"11:43:00",117,117.5,1630.9,1618,1630]
[null,"11:44:00",116,116.5,1617.02,1604,1617]
[null,"11:45:00",115,115.5,1603.14,1590,1603]
[null,"11:46:00",114,114.5,1589.26,1576,1589]
[null,"11:47:00",113,113.5,1575.38,1562,1575]
[null,{"$f":"B17-1/24/60","v":"11:48:00"},{"$f":"C17+1","v":112},{"$f":"C16+0.5","v":112.5},{"$f":"D16/Race*RefPY","v":1561.5},{"$f":"G17+1","v":1548},{"$f":"INT(E16)","v":1561}]
[null,"11:49:00",111,111.5,1547.62,1534,1547]
[null,"11:50:00",110,110.5,1533.74,1520,1533]
[null,"11:51:00",109,109.5,1519.86,1506,1519]
[null,"11:52:00",108,108.5,1505.98,1493,1505]
[null,"11:53:00",107,107.5,1492.1,1479,1492]
[null,"11:54:00",106,106.5,1478.22,1465,1478]
[null,"11:55:00",105,105.5,1464.34,1451,1464]
[null,"11:56:00",104,104.5,1450.4599999999998,{"$f":"G25+1","v":1437},{"$f":"INT(E24)","v":1450}]
[null,"11:57:00",103,103.5,1436.58,{"$f":"G26+1","v":1423},{"$f":"INT(E25)","v":1436}]
[null,"11:58:00",102,102.5,1422.6999999999998,{"$f":"G27+1","v":1409},{"$f":"INT(E26)","v":1422}]
[null,"11:59:00",101,{"$f":"C27+0.5","v":101.5},{"$f":"D27/Race*RefPY","v":1408.82},{"$f":"G28+1","v":1395},{"$f":"INT(E27)","v":1408}]
[null,{"$f":"Start","v":"12:00:00"},{"$f":"Race","v":100},{"$f":"C28+0.5","v":100.5},{"$f":"D28/Race*RefPY","v":1394.9399999999998},{"$f":"G29+1","v":1382},{"$f":"INT(E28)","v":1394},1,{"$f":"IF(ISERROR((VLOOKUP(H28,'PY DATA'!$Q$3:$S$100,3,FALSE))),\" \",VLOOKUP(H28,'PY DATA'!$Q$3:$S$100,3,FALSE))","v":"Gull"}]
[null,{"$f":"B28+1/24/60","v":"12:01:00"},{"$f":"C28-1","v":99},{"$f":"C29+0.5","v":99.5},1381.06,{"$f":"G30+1","v":1368},{"$f":"INT(E29)","v":1381},{"$f":"H28+1","v":2},{"$f":"IF(ISERROR((VLOOKUP(H29,'PY DATA'!$Q$3:$S$100,3,FALSE))),\" \",VLOOKUP(H29,'PY DATA'!$Q$3:$S$100,3,FALSE))","v":" "}]
[null,{"$f":"B29+1/24/60","v":"12:02:00"},{"$f":"C29-1","v":98},98.5,1367.18,1354,1367,{"$f":"H29+1","v":3},{"$f":"IF(ISERROR((VLOOKUP(H30,'PY DATA'!$Q$3:$S$100,3,FALSE))),\" \",VLOOKUP(H30,'PY DATA'!$Q$3:$S$100,3,FALSE))","v":"Topper"}]
[null,"12:03:00",97,97.5,1353.3,1340,1353,4,{"$f":"IF(ISERROR((VLOOKUP(H31,'PY DATA'!$Q$3:$S$100,3,FALSE))),\" \",VLOOKUP(H31,'PY DATA'!$Q$3:$S$100,3,FALSE))","v":" "}]
[null,"12:04:00",96,96.5,1339.4199999999998,1326,1339,5,{"$f":"IF(ISERROR((VLOOKUP(H32,'PY DATA'!$Q$3:$S$100,3,FALSE))),\" \",VLOOKUP(H32,'PY DATA'!$Q$3:$S$100,3,FALSE))","v":"Pico"}]
[null,"12:05:00",95,95.5,1325.54,1312,1325,6,{"$f":"IF(ISERROR((VLOOKUP(H33,'PY DATA'!$Q$3:$S$100,3,FALSE))),\" \",VLOOKUP(H33,'PY DATA'!$Q$3:$S$100,3,FALSE))","v":" "}]
[null,"12:06:00",94,94.5,1311.6599999999999,1298,1311,7,{"$f":"IF(ISERROR((VLOOKUP(H34,'PY DATA'!$Q$3:$S$100,3,FALSE))),\" \",VLOOKUP(H34,'PY DATA'!$Q$3:$S$100,3,FALSE))","v":"Quba S"}]
[null,"12:07:00",93,93.5,1297.78,1284,1297,8,{"$f":"IF(ISERROR((VLOOKUP(H35,'PY DATA'!$Q$3:$S$100,3,FALSE))),\" \",VLOOKUP(H35,'PY DATA'!$Q$3:$S$100,3,FALSE))","v":" "}]
[null,"12:08:00",92,92.5,1283.9000000000001,1271,1283,9,{"$f":"IF(ISERROR((VLOOKUP(H36,'PY DATA'!$Q$3:$S$100,3,FALSE))),\" \",VLOOKUP(H36,'PY DATA'!$Q$3:$S$100,3,FALSE))","v":"Feva S"}]
[null,"12:09:00",91,91.5,1270.02,1257,1270,10,{"$f":"IF(ISERROR((VLOOKUP(H37,'PY DATA'!$Q$3:$S$100,3,FALSE))),\" \",VLOOKUP(H37,'PY DATA'!$Q$3:$S$100,3,FALSE))","v":"Topaz Uno"}]
[null,"12:10:00",90,90.5,1256.1400000000001,1243,1256,11,{"$f":"IF(ISERROR((VLOOKUP(H38,'PY DATA'!$Q$3:$S$100,3,FALSE))),\" \",VLOOKUP(H38,'PY DATA'!$Q$3:$S$100,3,FALSE))","v":" "}]
[null,"12:11:00",89,89.5,1242.26,1229,1242,12,{"$f":"IF(ISERROR((VLOOKUP(H39,'PY DATA'!$Q$3:$S$100,3,FALSE))),\" \",VLOOKUP(H39,'PY DATA'!$Q$3:$S$100,3,FALSE))","v":" "}]
[null,"12:12:00",88,88.5,1228.3800000000001,1215,1228,13,{"$f":"IF(ISERROR((VLOOKUP(H40,'PY DATA'!$Q$3:$S$100,3,FALSE))),\" \",VLOOKUP(H40,'PY DATA'!$Q$3:$S$100,3,FALSE))","v":" "}]
{"$rows_left_out":50}
{"sheet":"PY DATA","index":3,"n_rows":1330,"n_cols":19,"rows_kept":1330,"cut":false,"hidden":false,"merged":[]}
[]
[null,"PY","GROUP",null,"Group","Class Name","PY","Classes in Race",null,"GROUP",null,null,null,null,"GROUP CLASS",null,"Group",null,"Group Classes"]
[null,{"$f":"MIN($G$3:$G$97)-20","v":896},{"$f":"Race-INT(Race*B3/RefPY+0.5)+1","v":36},null,{"$f":"VLOOKUP(G3,$B$3:$C$1500,2,FALSE)","v":1},"Gull",1388,{"$f":"IF((G3<=RefPY), F3,\"X\")","v":"Gull"},null,{"$f":"VLOOKUP(G3,$B$3:$C$1500,2,FALSE)","v":1},{"$f":"J3&\"-\"&L3","v":"1-1"},{"$f":"IF(J3=J2,L2+1,1)","v":1},{"$f":"COUNTIF($J$3:$J$97,J3)","v":1},{"$f":"J3&\"-\"&M3","v":"1-1"},{"$f":"IF((J3=J2)*AND(O2<>\"X\"),O2&\",  \"&H3,H3)","v":"Gull"},null,1,{"$f":"VLOOKUP(Q3,$J$3:$N$97,5,FALSE)","v":"1-1"},{"$f":"VLOOKUP(R3,$K$3:$O$97,5,FALSE)","v":"Gull"}]
[null,{"$f":"B3+1","v":897},{"$f":"Race-INT(Race*B4/RefPY+0.5)+1","v":36},null,3,"Topper",1363,{"$f":"IF((G4<=RefPY), F4,\"X\")","v":"Topper"},null,3,{"$f":"J4&\"-\"&L4","v":"3-1"},{"$f":"IF(J4=J3,L3+1,1)","v":1},{"$f":"COUNTIF($J$3:$J$97,J4)","v":1},{"$f":"J4&\"-\"&M4","v":"3-1"},{"$f":"IF((J4=J3)*AND(O3<>\"X\"),O3&\",  \"&H4,H4)","v":"Topper"},null,{"$f":"Q3+1","v":2},{"$f":"VLOOKUP(Q4,$J$3:$N$97,5,FALSE)","v":{"$error":"#N/A"}},{"$f":"VLOOKUP(R4,$K$3:$O$97,5,FALSE)","v":{"$error":"#N/A"}}]
[null,{"$f":"B4+1","v":898},36,null,5,"Pico",1330,"Pico",null,5,"5-1",1,{"$f":"COUNTIF($J$3:$J$97,J5)","v":1},"5-1","Pico",null,{"$f":"Q4+1","v":3},"3-1","Topper"]
[null,899,36,null,7,"Quba S",1300,"Quba S",null,7,"7-1",1,1,"7-1","Quba S",null,4,{"$error":"#N/A"},{"$error":"#N/A"}]
[null,900,36,null,9,"Feva S",1282,"Feva S",null,9,"9-1",1,1,"9-1","Feva S",null,5,"5-1","Pico"]
[null,901,36,null,10,"Topaz Uno",1257,"Topaz Uno",null,10,"10-1",1,1,"10-1","Topaz Uno",null,6,{"$error":"#N/A"},{"$error":"#N/A"}]
[null,902,36,null,14,4.7,1210,4.7,null,14,"14-1",1,1,"14-1",4.7,null,7,"7-1","Quba S"]
[null,903,36,null,15,"Wanderer",1200,"Wanderer",null,15,"15-1",1,3,"15-3","Wanderer",null,8,{"$error":"#N/A"},{"$error":"#N/A"}]
[null,904,36,null,15,"Miracle",1196,"Miracle",null,15,"15-2",2,3,"15-3","Wanderer,  Miracle",null,9,"9-1","Feva S"]
[null,905,36,null,15,"Lightning",1191,"Lightning",null,15,"15-3",3,3,"15-3","Wanderer,  Miracle,  Lightning",null,10,"10-1","Topaz Uno"]
[null,906,36,null,17,"Enterprise",1160,"Enterprise",null,17,"17-1",1,2,"17-2","Enterprise",null,11,{"$error":"#N/A"},{"$error":"#N/A"}]
[null,907,36,null,17,"Graduate (orig)",1159,"Graduate (orig)",null,17,"17-2",2,2,"17-2","Enterprise,  Graduate (orig)",null,12,{"$error":"#N/A"},{"$error":"#N/A"}]
[null,908,36,null,18,"Radial",1154,"Radial",null,18,"18-1",1,2,"18-2","Radial",null,13,{"$error":"#N/A"},{"$error":"#N/A"}]
[null,909,36,null,18,"Europe",1153,"Europe",null,18,"18-2",2,2,"18-2","Radial,  Europe",null,14,"14-1",4.7]
[null,910,35,null,19,"Vision",1138,"Vision",null,19,"19-1",1,1,"19-1","Vision",null,15,"15-3","Wanderer,  Miracle,  Lightning"]
[null,911,35,null,20,"Graduate (new)",1125,"Graduate (new)",null,20,"20-1",1,2,"20-2","Graduate (new)",null,16,{"$error":"#N/A"},{"$error":"#N/A"}]
[null,912,35,null,20,"Streaker",1124,"Streaker",null,20,"20-2",2,2,"20-2","Graduate (new),  Streaker",null,17,"17-2","Enterprise,  Graduate (orig)"]
[null,913,35,null,21,"Wayfarer",1116,"Wayfarer",null,21,"21-1",1,2,"21-2","Wayfarer",null,18,"18-2","Radial,  Europe"]
[null,914,35,null,21,"Vareo",1108,"Vareo",null,21,"21-2",2,2,"21-2","Wayfarer,  Vareo",null,19,"19-1","Vision"]
[null,915,35,null,22,"Laser",1099,"Laser",null,22,"22-1",1,1,"22-1","Laser",null,20,"20-2",{"$f":"VLOOKUP(R22,$K$3:$O$97,5,FALSE)","v":"Graduate (new),  Streaker"}]
[null,916,35,null,24,"Vago XD",1072,"Vago XD",null,24,"24-1",1,1,"24-1","Vago XD",null,21,"21-2","Wayfarer,  Vareo"]
[null,917,35,null,25,"Blaze Fire",1050,"Blaze Fire",null,25,"25-1",1,1,"25-1","Blaze Fire",null,22,"22-1","Laser"]
[null,918,35,null,27,"Blaze",1027,"Blaze",null,27,"27-1",1,1,"27-1","Blaze",null,23,{"$error":"#N/A"},{"$error":"#N/A"}]
[null,919,35,null,31,"Contender",966,"Contender",null,31,"31-1",1,1,"31-1","Contender",null,24,"24-1","Vago XD"]
[null,920,35,null,32,4000,955,4000,null,32,"32-1",1,1,"32-1",4000,null,25,"25-1","Blaze Fire"]
[null,921,35,null,33,"Osprey",950,"Osprey",null,33,"33-1",1,2,"33-2","Osprey",null,26,{"$error":"#N/A"},{"$error":"#N/A"}]
[null,922,35,null,33,"RS 400",942,"RS 400",null,33,"33-2",2,2,"33-2","Osprey,  RS 400",null,27,"27-1","Blaze"]
[null,923,35,null,35,"RS 600",916,"RS 600",null,35,"35-1",1,1,"35-1","RS 600",null,28,{"$error":"#N/A"},{"$error":"#N/A"}]
[null,924,34,null,{"$error":"#N/A"},null,null,0,null,{"$error":"#N/A"},{"$error":"#N/A"},{"$error":"#N/A"},67,{"$error":"#N/A"},{"$error":"#N/A"},null,29,{"$error":"#N/A"},{"$error":"#N/A"}]
[null,925,34,null,{"$error":"#N/A"},null,null,0,null,{"$error":"#N/A"},{"$error":"#N/A"},{"$error":"#N/A"},67,{"$error":"#N/A"},{"$error":"#N/A"},null,30,{"$error":"#N/A"},{"$error":"#N/A"}]
[null,926,34,null,{"$error":"#N/A"},null,null,0,null,{"$error":"#N/A"},{"$error":"#N/A"},{"$error":"#N/A"},67,{"$error":"#N/A"},{"$error":"#N/A"},null,31,"31-1","Contender"]
[null,927,34,null,{"$error":"#N/A"},null,null,0,null,{"$error":"#N/A"},{"$error":"#N/A"},{"$error":"#N/A"},67,{"$error":"#N/A"},{"$error":"#N/A"},null,32,"32-1",4000]
[null,928,34,null,{"$f":"VLOOKUP(G35,$B$3:$C$1500,2,FALSE)","v":{"$error":"#N/A"}},null,null,0,null,{"$f":"VLOOKUP(G35,$B$3:$C$1500,2,FALSE)","v":{"$error":"#N/A"}},{"$error":"#N/A"},{"$error":"#N/A"},67,{"$error":"#N/A"},{"$error":"#N/A"},null,33,{"$f":"VLOOKUP(Q35,$J$3:$N$97,5,FALSE)","v":"33-2"},"Osprey,  RS 400"]
[null,929,34,null,{"$error":"#N/A"},null,null,0,null,{"$error":"#N/A"},{"$error":"#N/A"},{"$error":"#N/A"},67,{"$error":"#N/A"},{"$error":"#N/A"},null,34,{"$error":"#N/A"},{"$error":"#N/A"}]
[null,930,34,null,{"$error":"#N/A"},null,null,0,null,{"$error":"#N/A"},{"$error":"#N/A"},{"$error":"#N/A"},67,{"$error":"#N/A"},{"$error":"#N/A"},null,35,"35-1","RS 600"]
[null,931,34,null,{"$error":"#N/A"},null,null,0,null,{"$error":"#N/A"},{"$error":"#N/A"},{"$error":"#N/A"},67,{"$error":"#N/A"},{"$error":"#N/A"},null,36,{"$error":"#N/A"},{"$f":"VLOOKUP(R38,$K$3:$O$97,5,FALSE)","v":{"$error":"#N/A"}}]
[null,932,34,null,{"$error":"#N/A"},null,null,0,null,{"$error":"#N/A"},{"$error":"#N/A"},{"$error":"#N/A"},67,{"$error":"#N/A"},{"$error":"#N/A"},null,37,{"$error":"#N/A"},{"$error":"#N/A"}]
[null,933,34,null,{"$error":"#N/A"},null,null,0,null,{"$error":"#N/A"},{"$error":"#N/A"},{"$error":"#N/A"},67,{"$error":"#N/A"},{"$error":"#N/A"},null,38,{"$error":"#N/A"},{"$error":"#N/A"}]
{"$rows_left_out":1291}
{"sheet":"Changes","index":4,"n_rows":41,"n_cols":3,"rows_kept":41,"cut":false,"hidden":false,"merged":[]}
[]
["2013-10-01",null,"Column C in sheet PY DATA.  (Neil)"]
[null,null,"The method used to determine the group numbers in Column C from the group numbers in column B was not valid at the extremes of the range."]
[null,null,"For a race of realistic settings this made no difference in practice."]
[null,null,"But a different formula is now used to calculate the group number from the PY number, which is correct for all PYs in the list."]
[]
["2013-10-01",null,"The Drop-down list for Slowest Class selection on the RACE SETUP page. Data Validation.  (Neil)"]
[null,null,"This used to be taken from an area off the right of the screen, linked to the PY list on the PY DATA sheet"]
[null,null,"The drop-down list now references the PY DATA sheet directly by referring to a named range called PYlist (In    Data - Data Validation)"]
[null,null,"PYlist is a dynamic named range. That means that as boats are added to or deleted from the list, the range changes. "]
[null,null,"This avoids having all the blank rows from lower down the list appearing in the drop-down list."]
[null,null,"Look in     Formulas - Name Manager     to see the definition of PYlist."]
[]
["2013-10-01",null,"PY DATA sheet. (Neil)"]
[null,null,"Formula in column H amended to show an X if the class is slower than RefPY and hence not in the race."]
[null,null,"Formula in Column O amended so as to not append to cell above if the cell above contains an X"]
[]
["2013-10-01",null,"RO ONLY sheet added  (Janice)"]
[]
["2014-05-01",null,"PYs updated for 2014 (Tudor PYs)"]
[]
["2015-09-01",null,"PYs updated for 2015 (Tudor PYs)"]
[]
["2016-04-01",null,"Change settings for the cell containing \"Slowest Class competing\" drop-down menu on RACE SETUP sheet.  (Neil)"]
[null,null,"(Because newer versions of Excel behave differently to old version)"]
[null,null,"The cell is now not Locked.   In DataValidation the \"Ignore blank\" option is now unticked."]
[]
["2016-05-01",null,"DISPLAY NOTICE (together with SIs) changed.  (Neil)"]
[null,null,"Group Numbers for starting are no longer used. Instead there is a START TIME OFFSET."]
[null,null,"RO ONLY sheet deleted (no longer needed)"]
[null,null,"PYs updated for 2016 (Tudor PYs)"]
[]
["2017-05-01",null,"PYs updated for 2017 (Tudor PYs)"]
["2017-07-01",null,"Some Tudor PYs updated/added"]
["2018-03-01",null,"PYs updated for 2018 (Tudor PYs)"]
["2019-04-01",null,"PYs updated for 2019 (Tudor PYs)"]
["2022-04-01",null,"PYs updated for 2022 (Tudor PYs)"]
["2023-03-01",null,"PYs updated for 2023 (Tudor PYs)"]
["2023-05-01",null,"Tudor PY for Vago XD changed from 1067 to 1068"]
["2024-05-01",null,"PYs updated for 2024 (Tudor PYs)"]
{"$rows_left_out":1}